Target
Mitochondrial import inner membrane translocase subunit TIM10
Ligand
BDBM89107
Substrate
Meas. Tech.
SAR analysis of small molecule inhibitors of tim23-1: a luminescent TIM10 yeast counterscreen.
IC50
32860±n/a nM
Citation
 PubChem, PC SAR analysis of small molecule inhibitors of tim23-1: a luminescent TIM10 yeast counterscreen. PubChem Bioassay (2012)[AID] 
Target
Name:
Mitochondrial import inner membrane translocase subunit TIM10
Synonyms:
MRS11 TIM10_YEAST TPA: Essential protein of the mitochondrial intermembrane space, forms a complex with Tim9p (TIM10 complex) that delivers hydrophobic proteins to the TIM22 complex for insertion into the inner ...
Type:
Enzyme Catalytic Domain
Mol. Mass.:
10303.50
Organism:
Saccharomyces cerevisiae S288c
Description:
gi_285809906
Residue:
93
  
Inhibitor
Name:
BDBM89107
Synonyms:
7-methyl-2-(quinolin-2-ylsulfanylmethyl)pyrido[1,2-a]pyrimidin-4-one 7-methyl-2-[(2-quinolylthio)methyl]pyrido[1,2-a]pyrimidin-4-one cid_7754748
Type:
Small organic molecule
Emp. Form.:
C19H15N3OS
Mol. Mass.:
333.407
SMILES:
Cc1ccc2nc(CSc3ccc4ccccc4n3)cc(=O)n2c1
: