Target
Mitochondrial import inner membrane translocase subunit TIM10
Ligand
BDBM89111
Substrate
Meas. Tech.
SAR analysis of small molecule inhibitors of tim23-1: a luminescent TIM10 yeast counterscreen.
IC50
>99000±n/a nM
Citation
 PubChem, PC SAR analysis of small molecule inhibitors of tim23-1: a luminescent TIM10 yeast counterscreen. PubChem Bioassay (2012)[AID] 
Target
Name:
Mitochondrial import inner membrane translocase subunit TIM10
Synonyms:
MRS11 TIM10_YEAST TPA: Essential protein of the mitochondrial intermembrane space, forms a complex with Tim9p (TIM10 complex) that delivers hydrophobic proteins to the TIM22 complex for insertion into the inner ...
Type:
Enzyme Catalytic Domain
Mol. Mass.:
10303.50
Organism:
Saccharomyces cerevisiae S288c
Description:
gi_285809906
Residue:
93
  
Inhibitor
Name:
BDBM89111
Synonyms:
MLS-0463378.0001 N-(6-amino-1-benzyl-2,4-dioxopyrimidin-5-yl)-N-methyl-3-methylsulfonylbenzamide N-[6-azanyl-2,4-bis(oxidanylidene)-1-(phenylmethyl)pyrimidin-5-yl]-N-methyl-3-methylsulfonyl-benzamide | cid_16294517
Type:
Small organic molecule
Emp. Form.:
C20H20N4O5S
Mol. Mass.:
428.462
SMILES:
CN(C(=O)c1cccc(c1)S(C)(=O)=O)c1c(N)n(Cc2ccccc2)c(=O)[nH]c1=O
: