Target
Mitochondrial import inner membrane translocase subunit TIM10
Ligand
BDBM89118
Substrate
Meas. Tech.
SAR analysis of small molecule inhibitors of tim23-1: a luminescent TIM10 yeast counterscreen.
IC50
35980±n/a nM
Citation
 PubChem, PC SAR analysis of small molecule inhibitors of tim23-1: a luminescent TIM10 yeast counterscreen. PubChem Bioassay (2012)[AID] 
Target
Name:
Mitochondrial import inner membrane translocase subunit TIM10
Synonyms:
MRS11 TIM10_YEAST TPA: Essential protein of the mitochondrial intermembrane space, forms a complex with Tim9p (TIM10 complex) that delivers hydrophobic proteins to the TIM22 complex for insertion into the inner ...
Type:
Enzyme Catalytic Domain
Mol. Mass.:
10303.50
Organism:
Saccharomyces cerevisiae S288c
Description:
gi_285809906
Residue:
93
  
Inhibitor
Name:
BDBM89118
Synonyms:
MLS-0463385.0001 N-(1,3-benzothiazol-2-yl)-1-(4-fluorophenyl)sulfonyl-pyrrolidine-2-carboxamide cid_16827469
Type:
Small organic molecule
Emp. Form.:
C18H16FN3O3S2
Mol. Mass.:
405.466
SMILES:
Fc1ccc(cc1)S(=O)(=O)N1CCCC1C(=O)Nc1nc2ccccc2s1
: