Target
DNA (cytosine-5)-methyltransferase 1
Ligand
BDBM58430
Substrate
Meas. Tech.
Dose response confirmation of DNMT1 inhibitors in a Fluorescent Molecular Beacon assay
IC50
4080±228 nM
Citation
 PubChem, PC Dose response confirmation of DNMT1 inhibitors in a Fluorescent Molecular Beacon assay PubChem Bioassay (2012)[AID] 
Target
Name:
DNA (cytosine-5)-methyltransferase 1
Synonyms:
AIM CXXC9 DNA (cytosine-5)-methyltransferase 1 isoform b DNA methyltransferase HsaI DNMT1 M.HsaI | MCMT
Type:
Enzyme
Mol. Mass.:
183184.85
Organism:
Homo sapiens (Human)
Description:
P26358
Residue:
1616
  
Inhibitor
Name:
BDBM58430
Synonyms:
((5E)-5-{[5-(4-bromophenyl)-2-furyl]methylene}-4-oxo-2-thioxo-1,3-thiazolidin-3-yl)(phenyl)acetic acid 2-[(5E)-5-[[5-(4-bromophenyl)-2-furyl]methylene]-4-keto-2-thioxo-thiazolidin-3-yl]-2-phenyl-acetic acid 2-[(5E)-5-[[5-(4-bromophenyl)furan-2-yl]methylidene]-4-oxo-2-sulfanylidene-1,3-thiazolidin-3-yl]-2-phenylacetic acid SMR000558866 | cid_5902538
Type:
Small organic molecule
Emp. Form.:
C22H14BrNO4S2
Mol. Mass.:
500.385
SMILES:
OC(=O)C(N1C(=S)S\C(=C\c2ccc(o2)-c2ccc(Br)cc2)C1=O)c1ccccc1
: