Target
DNA (cytosine-5)-methyltransferase 1
Ligand
BDBM76715
Substrate
Meas. Tech.
Dose response confirmation of DNMT1 inhibitors in a Fluorescent Molecular Beacon assay
IC50
3850±78 nM
Citation
 PubChem, PC Dose response confirmation of DNMT1 inhibitors in a Fluorescent Molecular Beacon assay PubChem Bioassay (2012)[AID] 
Target
Name:
DNA (cytosine-5)-methyltransferase 1
Synonyms:
AIM CXXC9 DNA (cytosine-5)-methyltransferase 1 isoform b DNA methyltransferase HsaI DNMT1 M.HsaI | MCMT
Type:
Enzyme
Mol. Mass.:
183184.85
Organism:
Homo sapiens (Human)
Description:
P26358
Residue:
1616
  
Inhibitor
Name:
BDBM76715
Synonyms:
(5E)-5-[(6-nitro-1,3-benzodioxol-5-yl)methylene]-2-thioxo-4-imidazolidinone (5E)-5-[(6-nitro-1,3-benzodioxol-5-yl)methylidene]-2-sulfanylidene-4-imidazolidinone (5E)-5-[(6-nitro-1,3-benzodioxol-5-yl)methylidene]-2-sulfanylideneimidazolidin-4-one SMR000556071 | cid_698849
Type:
Small organic molecule
Emp. Form.:
C11H7N3O5S
Mol. Mass.:
293.255
SMILES:
[O-]c1[nH]c(=S)[nH]c1[CH+]c1cc2OCOc2cc1[N+]([O-])=O
: