Target
Caspase-9
Ligand
BDBM89226
Substrate
Meas. Tech.
SAR analysis of small molecule inhibitors of Apaf-1 using a LZ-Caspase-9/Caspase-3 Fluorescent Selectivity assay - Set 2
IC50
20100±n/a nM
Citation
 PubChem, PC SAR analysis of small molecule inhibitors of Apaf-1 using a LZ-Caspase-9/Caspase-3 Fluorescent Selectivity assay - Set 2 PubChem Bioassay (2012)[AID] 
Target
Name:
Caspase-9
Synonyms:
Apoptotic protease-activating factor 1/Caspase-3/Caspase-9/Cytochrome c CASP-9 CASP9_HUMAN ICE-like apoptotic protease 6 caspase-9 isoform alpha preproprotein
Type:
Enzyme
Mol. Mass.:
46277.29
Organism:
Homo sapiens (Human)
Description:
Residue:
416
  
Inhibitor
Name:
BDBM89226
Synonyms:
1-(3,4-dichlorobenzyl)-4,6-dimethyl-isatin 1-[(3,4-dichlorophenyl)methyl]-4,6-dimethylindole-2,3-dione cid_53389328
Type:
Small organic molecule
Emp. Form.:
C17H13Cl2NO2
Mol. Mass.:
334.197
SMILES:
Cc1cc2N(Cc3ccc(Cl)c(Cl)c3)C(=O)C(=O)c2c(C)c1
: