Target
Zinc finger protein GLI1
Ligand
BDBM89283
Substrate
Meas. Tech.
Dose response confirmation of uHTS antagonist hits from Gli-SUFU in a luminescent reporter assay
IC50
535±n/a nM
Citation
 PubChem, PC Dose response confirmation of uHTS antagonist hits from Gli-SUFU in a luminescent reporter assay PubChem Bioassay (2012)[AID] 
Target
Name:
Zinc finger protein GLI1
Synonyms:
GLI1_MOUSE Gli1 | Glioma-associated oncogene homolog
Type:
PROTEIN
Mol. Mass.:
118579.34
Organism:
Mus musculus
Description:
EBI_101259
Residue:
1111
  
Inhibitor
Name:
BDBM89283
Synonyms:
4-acetyl-3,5-dimethyl-1H-pyrrole-2-carboxylic acid [2-(4-methyl-2-nitroanilino)-2-oxoethyl] ester MLS000391298 [2-(4-methyl-2-nitroanilino)-2-oxoethyl] 4-acetyl-3,5-dimethyl-1H-pyrrole-2-carboxylate cid_5057113
Type:
Small organic molecule
Emp. Form.:
C18H19N3O6
Mol. Mass.:
373.36
SMILES:
CC(=O)c1c(C)[nH]c(C(=O)OCC(=O)Nc2ccc(C)cc2[N+]([O-])=O)c1C
: