Target
Apoptotic protease-activating factor 1
Ligand
BDBM89499
Substrate
Meas. Tech.
SAR analysis of small molecule Activators of Apaf-1 in a Fluorescent assay - set 2
EC50
83200±n/a nM
Citation
 PubChem, PC SAR analysis of small molecule Activators of Apaf-1 in a Fluorescent assay - set 2 PubChem Bioassay (2012)[AID] 
Target
Name:
Apoptotic protease-activating factor 1
Synonyms:
APAF1 Apoptotic peptidase activating factor 1 | KIAA0413
Type:
Enzyme Catalytic Domain
Mol. Mass.:
141834.40
Organism:
Homo sapiens (Human)
Description:
O14727
Residue:
1248
  
Inhibitor
Name:
BDBM89499
Synonyms:
3-(1-benzimidazolyl)-2-methylpropanoic acid 3-(benzimidazol-1-yl)-2-methyl-propionic acid MLS-0083401.0001 | cid_2911125
Type:
Small organic molecule
Emp. Form.:
C11H12N2O2
Mol. Mass.:
204.2252
SMILES:
CC(Cn1cnc2ccccc12)C(O)=O
: