Target
Apoptotic protease-activating factor 1
Ligand
BDBM89506
Substrate
Meas. Tech.
SAR analysis of small molecule Activators of Apaf-1 in a Fluorescent assay - set 2
EC50
>100000±n/a nM
Citation
 PubChem, PC SAR analysis of small molecule Activators of Apaf-1 in a Fluorescent assay - set 2 PubChem Bioassay (2012)[AID] 
Target
Name:
Apoptotic protease-activating factor 1
Synonyms:
APAF1 Apoptotic peptidase activating factor 1 | KIAA0413
Type:
Enzyme Catalytic Domain
Mol. Mass.:
141834.40
Organism:
Homo sapiens (Human)
Description:
O14727
Residue:
1248
  
Inhibitor
Name:
BDBM89506
Synonyms:
3-(2-methoxyphenyl)-2-isoxazoline-5-carboxylic acid 3-(2-methoxyphenyl)-4,5-dihydroisoxazole-5-carboxylic acid cid_2978658
Type:
Small organic molecule
Emp. Form.:
C11H11NO4
Mol. Mass.:
221.2093
SMILES:
COc1ccccc1C1=NOC(C1)C(O)=O
: