Target
Caspase-9
Ligand
BDBM89492
Substrate
Meas. Tech.
SAR analysis of small molecule activators of Apaf-1 using a LZ-Caspase-9/Caspase-3 Fluorescent Selectivity assay - Set 2
EC50
>100000±n/a nM
Citation
 PubChem, PC SAR analysis of small molecule activators of Apaf-1 using a LZ-Caspase-9/Caspase-3 Fluorescent Selectivity assay - Set 2 PubChem Bioassay (2012)[AID] 
Target
Name:
Caspase-9
Synonyms:
Apoptotic protease-activating factor 1/Caspase-3/Caspase-9/Cytochrome c CASP-9 CASP9_HUMAN ICE-like apoptotic protease 6 caspase-9 isoform alpha preproprotein
Type:
Enzyme
Mol. Mass.:
46277.29
Organism:
Homo sapiens (Human)
Description:
Residue:
416
  
Inhibitor
Name:
BDBM89492
Synonyms:
3-(5-chloranyl-2,4-dimethoxy-phenyl)-4,5-dihydro-1,2-oxazole-5-carboxylic acid 3-(5-chloro-2,4-dimethoxyphenyl)-4,5-dihydro-1,2-oxazole-5-carboxylic acid MLS-0037691.0001 | cid_2974597
Type:
Small organic molecule
Emp. Form.:
C12H12ClNO5
Mol. Mass.:
285.68
SMILES:
COc1cc(OC)c(cc1Cl)C1=NOC(C1)C(O)=O
: