Target
Corticotropin-releasing factor-binding protein
Ligand
BDBM50322732
Substrate
Meas. Tech.
Dose Response confirmation of uHTS hits for small molecule agonists of the CRF-binding protein and CRF-R2 receptor complex
EC50
4490±n/a nM
Citation
 PubChem, PC Dose Response confirmation of uHTS hits for small molecule agonists of the CRF-binding protein and CRF-R2 receptor complex PubChem Bioassay (2012)[AID] 
Target
Name:
Corticotropin-releasing factor-binding protein
Synonyms:
CRFBP CRHBP_HUMAN | corticotropin releasing factor-binding protein
Type:
Enzyme Catalytic Domain
Mol. Mass.:
36143.95
Organism:
Homo sapiens (Human)
Description:
P24387
Residue:
322
  
Inhibitor
Name:
BDBM50322732
Synonyms:
2-(5-methylisoxazol-3-ylamino)-2-oxoethyl 2-(furan-2-carboxamido)-3-phenylpropanoate cid_3000182
Type:
Small organic molecule
Emp. Form.:
C20H19N3O6
Mol. Mass.:
397.3814
SMILES:
Cc1cc(NC(=O)COC(=O)C(Cc2ccccc2)NC(=O)c2ccco2)no1
: