Target
Corticotropin-releasing factor-binding protein
Ligand
BDBM89708
Substrate
Meas. Tech.
Dose Response confirmation of uHTS hits for small molecule agonists of the CRF-binding protein and CRF-R2 receptor complex
EC50
>53000±n/a nM
Citation
 PubChem, PC Dose Response confirmation of uHTS hits for small molecule agonists of the CRF-binding protein and CRF-R2 receptor complex PubChem Bioassay (2012)[AID] 
Target
Name:
Corticotropin-releasing factor-binding protein
Synonyms:
CRFBP CRHBP_HUMAN | corticotropin releasing factor-binding protein
Type:
Enzyme Catalytic Domain
Mol. Mass.:
36143.95
Organism:
Homo sapiens (Human)
Description:
P24387
Residue:
322
  
Inhibitor
Name:
BDBM89708
Synonyms:
6-(3,4-dihydro-1H-isoquinolin-2-ylmethyl)-2-N-phenyl-1,3,5-triazine-2,4-diamine 6-(3,4-dihydro-2(1H)-isoquinolinylmethyl)-N-phenyl-1,3,5-triazine-2,4-diamine SMR000075213 cid_939226
Type:
Small organic molecule
Emp. Form.:
C19H20N6
Mol. Mass.:
332.4023
SMILES:
Nc1nc(CN2CCc3ccccc3C2)nc(Nc2ccccc2)n1
: