Target
Corticotropin-releasing factor-binding protein
Ligand
BDBM89771
Substrate
Meas. Tech.
Dose Response confirmation of uHTS hits for small molecule agonists of the CRF-binding protein and CRF-R2 receptor complex
EC50
>53000±n/a nM
Citation
 PubChem, PC Dose Response confirmation of uHTS hits for small molecule agonists of the CRF-binding protein and CRF-R2 receptor complex PubChem Bioassay (2012)[AID] 
Target
Name:
Corticotropin-releasing factor-binding protein
Synonyms:
CRFBP CRHBP_HUMAN | corticotropin releasing factor-binding protein
Type:
Enzyme Catalytic Domain
Mol. Mass.:
36143.95
Organism:
Homo sapiens (Human)
Description:
P24387
Residue:
322
  
Inhibitor
Name:
BDBM89771
Synonyms:
MLS000109496 N-[(4E)-4-(5,6-dimethyl-3H-1,3-benzoxazol-2-ylidene)-3-oxidanylidene-cyclohexa-1,5-dien-1-yl]butanamide N-[(4E)-4-(5,6-dimethyl-3H-1,3-benzoxazol-2-ylidene)-3-oxocyclohexa-1,5-dien-1-yl]butanamide cid_5346533
Type:
Small organic molecule
Emp. Form.:
C19H20N2O3
Mol. Mass.:
324.3737
SMILES:
CCCC(=O)Nc1ccc(-c2nc3cc(C)c(C)cc3o2)c(O)c1
: