Target
Corticotropin-releasing factor-binding protein
Ligand
BDBM91298
Substrate
Meas. Tech.
Dose Response confirmation of uHTS hits for small molecule agonists of the CRF-binding protein and CRF-R2 receptor complex
EC50
>53000±n/a nM
Citation
 PubChem, PC Dose Response confirmation of uHTS hits for small molecule agonists of the CRF-binding protein and CRF-R2 receptor complex PubChem Bioassay (2012)[AID] 
Target
Name:
Corticotropin-releasing factor-binding protein
Synonyms:
CRFBP CRHBP_HUMAN | corticotropin releasing factor-binding protein
Type:
Enzyme Catalytic Domain
Mol. Mass.:
36143.95
Organism:
Homo sapiens (Human)
Description:
P24387
Residue:
322
  
Inhibitor
Name:
BDBM91298
Synonyms:
2-[(2R,6S,8E,12S)-12-[(4-fluorophenyl)methyl]-5,13-bis(oxidanylidene)-2-phenyl-1-oxa-4-azacyclotridec-8-en-6-yl]-N-(2-hydroxyethyl)-N-(phenylmethyl)ethanamide MLS002320049 N-benzyl-2-[(2R,6S,8E,12S)-12-[(4-fluorophenyl)methyl]-5,13-dioxo-2-phenyl-1-oxa-4-azacyclotridec-8-en-6-yl]-N-(2-hydroxyethyl)acetamide cid_44201611
Type:
Small organic molecule
Emp. Form.:
C35H39FN2O5
Mol. Mass.:
586.693
SMILES:
OCCN(Cc1ccccc1)C(=O)C[C@@H]1C\C=C\CC[C@@H](Cc2ccc(F)cc2)C(=O)O[C@@H](CNC1=O)c1ccccc1
: