Target
Mitochondrial peptide methionine sulfoxide reductase
Ligand
BDBM87856
Substrate
Meas. Tech.
Absorbance-based biochemical high throughput dose response assay for activators of Methionine sulfoxide reductase A (MsrA)
EC50
>103919±n/a nM
Citation
 PubChem, PC Absorbance-based biochemical high throughput dose response assay for activators of Methionine sulfoxide reductase A (MsrA) PubChem Bioassay (2012)[AID] 
Target
Name:
Mitochondrial peptide methionine sulfoxide reductase
Synonyms:
MSRA MSRA_BOVIN
Type:
Enzyme Catalytic Domain
Mol. Mass.:
25822.90
Organism:
Bos taurus
Description:
gi_73586699
Residue:
233
  
Inhibitor
Name:
BDBM87856
Synonyms:
2-Mercapto-6-methoxymethyl-pyrimidin-4-ol 6-(methoxymethyl)-2-thioxo-1H-pyrimidin-4-one SMR000211746 | cid_704896
Type:
Small organic molecule
Emp. Form.:
C6H8N2O2S
Mol. Mass.:
172.205
SMILES:
COCc1cc(=O)[nH]c(=S)[nH]1
: