Target
Mitochondrial peptide methionine sulfoxide reductase
Ligand
BDBM91500
Substrate
Meas. Tech.
Absorbance-based biochemical high throughput dose response assay for activators of Methionine sulfoxide reductase A (MsrA)
EC50
>103886±n/a nM
Citation
 PubChem, PC Absorbance-based biochemical high throughput dose response assay for activators of Methionine sulfoxide reductase A (MsrA) PubChem Bioassay (2012)[AID] 
Target
Name:
Mitochondrial peptide methionine sulfoxide reductase
Synonyms:
MSRA MSRA_BOVIN
Type:
Enzyme Catalytic Domain
Mol. Mass.:
25822.90
Organism:
Bos taurus
Description:
gi_73586699
Residue:
233
  
Inhibitor
Name:
BDBM91500
Synonyms:
(6E)-2-bromanyl-6-[[(4-morpholin-4-ylphenyl)amino]methylidene]-4-nitro-cyclohexa-2,4-dien-1-one (6E)-2-bromo-6-[(4-morpholinoanilino)methylene]-4-nitro-cyclohexa-2,4-dien-1-one MLS000713482 cid_5435973
Type:
Small organic molecule
Emp. Form.:
C17H16BrN3O4
Mol. Mass.:
406.231
SMILES:
[O-][N+](=O)c1cc(Br)c(=O)[c-](\C=[NH+]\c2ccc(cc2)N2CCOCC2)c1
: