Target
Mitochondrial peptide methionine sulfoxide reductase
Ligand
BDBM65375
Substrate
Meas. Tech.
Absorbance-based biochemical high throughput dose response assay for activators of Methionine sulfoxide reductase A (MsrA)
EC50
>103951±n/a nM
Citation
 PubChem, PC Absorbance-based biochemical high throughput dose response assay for activators of Methionine sulfoxide reductase A (MsrA) PubChem Bioassay (2012)[AID] 
Target
Name:
Mitochondrial peptide methionine sulfoxide reductase
Synonyms:
MSRA MSRA_BOVIN
Type:
Enzyme Catalytic Domain
Mol. Mass.:
25822.90
Organism:
Bos taurus
Description:
gi_73586699
Residue:
233
  
Inhibitor
Name:
BDBM65375
Synonyms:
MLS000688659 N-[[(2-cyano-1-oxoethyl)hydrazo]-sulfanylidenemethyl]-4-methylbenzamide N-[[(2-cyanoacetyl)amino]thiocarbamoyl]-4-methyl-benzamide cid_1728285
Type:
Small organic molecule
Emp. Form.:
C12H12N4O2S
Mol. Mass.:
276.314
SMILES:
Cc1ccc(cc1)C(=O)NC(=S)NNC(=O)CC#N
: