Target
Mitochondrial peptide methionine sulfoxide reductase
Ligand
BDBM60846
Substrate
Meas. Tech.
Absorbance-based biochemical high throughput dose response assay for activators of Methionine sulfoxide reductase A (MsrA)
EC50
>103940±n/a nM
Citation
 PubChem, PC Absorbance-based biochemical high throughput dose response assay for activators of Methionine sulfoxide reductase A (MsrA) PubChem Bioassay (2012)[AID] 
Target
Name:
Mitochondrial peptide methionine sulfoxide reductase
Synonyms:
MSRA MSRA_BOVIN
Type:
Enzyme Catalytic Domain
Mol. Mass.:
25822.90
Organism:
Bos taurus
Description:
gi_73586699
Residue:
233
  
Inhibitor
Name:
BDBM60846
Synonyms:
(2-{[2-(hydroxymethyl)phenyl]disulfanyl}phenyl)methanol SMR000475641 [2-[[2-(hydroxymethyl)phenyl]disulfanyl]phenyl]methanol | cid_816729
Type:
Small organic molecule
Emp. Form.:
C14H14O2S2
Mol. Mass.:
278.39
SMILES:
OCc1ccccc1SSc1ccccc1CO
: