Target
Mitochondrial peptide methionine sulfoxide reductase
Ligand
BDBM76763
Substrate
Meas. Tech.
Absorbance-based biochemical high throughput dose response assay for activators of Methionine sulfoxide reductase A (MsrA)
EC50
22138±n/a nM
Citation
 PubChem, PC Absorbance-based biochemical high throughput dose response assay for activators of Methionine sulfoxide reductase A (MsrA) PubChem Bioassay (2012)[AID] 
Target
Name:
Mitochondrial peptide methionine sulfoxide reductase
Synonyms:
MSRA MSRA_BOVIN
Type:
Enzyme Catalytic Domain
Mol. Mass.:
25822.90
Organism:
Bos taurus
Description:
gi_73586699
Residue:
233
  
Inhibitor
Name:
BDBM76763
Synonyms:
5-nitro-2-thiophenecarboxylic acid [2-oxo-2-(2-phenylethylamino)ethyl] ester MLS002159124 [2-oxidanylidene-2-(2-phenylethylamino)ethyl] 5-nitrothiophene-2-carboxylate cid_7459101
Type:
Small organic molecule
Emp. Form.:
C15H14N2O5S
Mol. Mass.:
334.347
SMILES:
[O-][N+](=O)c1ccc(s1)C(=O)OCC(=O)NCCc1ccccc1
: