Target
Mitochondrial peptide methionine sulfoxide reductase
Ligand
BDBM76790
Substrate
Meas. Tech.
Absorbance-based biochemical high throughput dose response assay for activators of Methionine sulfoxide reductase A (MsrA)
EC50
22917±n/a nM
Citation
 PubChem, PC Absorbance-based biochemical high throughput dose response assay for activators of Methionine sulfoxide reductase A (MsrA) PubChem Bioassay (2012)[AID] 
Target
Name:
Mitochondrial peptide methionine sulfoxide reductase
Synonyms:
MSRA MSRA_BOVIN
Type:
Enzyme Catalytic Domain
Mol. Mass.:
25822.90
Organism:
Bos taurus
Description:
gi_73586699
Residue:
233
  
Inhibitor
Name:
BDBM76790
Synonyms:
5-nitro-2-thiophenecarboxylic acid [2-[(2,3-dimethylcyclohexyl)amino]-2-oxoethyl] ester MLS002245146 [2-[(2,3-dimethylcyclohexyl)amino]-2-oxidanylidene-ethyl] 5-nitrothiophene-2-carboxylate cid_3977768
Type:
Small organic molecule
Emp. Form.:
C15H20N2O5S
Mol. Mass.:
340.395
SMILES:
CC1CCCC(NC(=O)COC(=O)c2ccc(s2)[N+]([O-])=O)C1C
: