Target
Mitochondrial peptide methionine sulfoxide reductase
Ligand
BDBM22860
Substrate
Meas. Tech.
Absorbance-based biochemical high throughput dose response assay for activators of Methionine sulfoxide reductase A (MsrA)
EC50
3637±n/a nM
Citation
 PubChem, PC Absorbance-based biochemical high throughput dose response assay for activators of Methionine sulfoxide reductase A (MsrA) PubChem Bioassay (2012)[AID] 
Target
Name:
Mitochondrial peptide methionine sulfoxide reductase
Synonyms:
MSRA MSRA_BOVIN
Type:
Enzyme Catalytic Domain
Mol. Mass.:
25822.90
Organism:
Bos taurus
Description:
gi_73586699
Residue:
233
  
Inhibitor
Name:
BDBM22860
Synonyms:
1,2-Dione-Based Compound, 17 cid_72810
Type:
Small organic molecule
Emp. Form.:
C12H6N2O2
Mol. Mass.:
210.1882
SMILES:
O=C1C(=O)c2cccnc2-c2ncccc12
: