Target
DNA dC->dU-editing enzyme APOBEC-3G
Ligand
BDBM80562
Substrate
Meas. Tech.
SAR analysis of small molecule inhibitors of APOBEC3G DNA Deaminase via a fluorescence-based single-stranded DNA deaminase assay - Set 2
Temperature
298.15±n/a K
IC50
1100±n/a nM
Comments
extracted
Citation
 PubChem, PC SAR analysis of small molecule inhibitors of APOBEC3G DNA Deaminase via a fluorescence-based single-stranded DNA deaminase assay - Set 2 PubChem Bioassay (2012)[AID] 
Target
Name:
DNA dC->dU-editing enzyme APOBEC-3G
Synonyms:
ABC3G_HUMAN | APOBEC3G
Type:
Enzyme Catalytic Domain
Mol. Mass.:
46419.54
Organism:
Homo sapiens (Human)
Description:
gi_13399304
Residue:
384
  
Inhibitor
Name:
BDBM80562
Synonyms:
1-methyl-N-phenyl-3-pyridin-1-iumcarboxamide;chloride 1-methyl-N-phenylpyridin-1-ium-3-carboxamide;chloride SMR000588030 | cid_16248065
Type:
Small organic molecule
Emp. Form.:
C13H13N2O
Mol. Mass.:
213.2546
SMILES:
C[n+]1cccc(c1)C(=O)Nc1ccccc1
: