Target
DNA dC->dU-editing enzyme APOBEC-3G
Ligand
BDBM62590
Substrate
Meas. Tech.
SAR analysis of small molecule inhibitors of APOBEC3G DNA Deaminase via a fluorescence-based single-stranded DNA deaminase assay - Set 2
Temperature
298.15±n/a K
IC50
539±n/a nM
Comments
extracted
Citation
 PubChem, PC SAR analysis of small molecule inhibitors of APOBEC3G DNA Deaminase via a fluorescence-based single-stranded DNA deaminase assay - Set 2 PubChem Bioassay (2012)[AID] 
Target
Name:
DNA dC->dU-editing enzyme APOBEC-3G
Synonyms:
ABC3G_HUMAN | APOBEC3G
Type:
Enzyme Catalytic Domain
Mol. Mass.:
46419.54
Organism:
Homo sapiens (Human)
Description:
gi_13399304
Residue:
384
  
Inhibitor
Name:
BDBM62590
Synonyms:
4-amino-3-(3-bromophenyl)-1H-1,2,4-triazole-5-thione MLS000079998 cid_659951
Type:
Small organic molecule
Emp. Form.:
C8H7BrN4S
Mol. Mass.:
271.137
SMILES:
Nn1c(n[nH]c1=S)-c1cccc(Br)c1
: