Target
DNA dC->dU-editing enzyme APOBEC-3G
Ligand
BDBM91532
Substrate
Meas. Tech.
SAR analysis of small molecule inhibitors of APOBEC3G DNA Deaminase via a fluorescence-based single-stranded DNA deaminase assay - Set 2
Temperature
298.15±n/a K
IC50
>99000±n/a nM
Comments
extracted
Citation
 PubChem, PC SAR analysis of small molecule inhibitors of APOBEC3G DNA Deaminase via a fluorescence-based single-stranded DNA deaminase assay - Set 2 PubChem Bioassay (2012)[AID] 
Target
Name:
DNA dC->dU-editing enzyme APOBEC-3G
Synonyms:
ABC3G_HUMAN | APOBEC3G
Type:
Enzyme Catalytic Domain
Mol. Mass.:
46419.54
Organism:
Homo sapiens (Human)
Description:
gi_13399304
Residue:
384
  
Inhibitor
Name:
BDBM91532
Synonyms:
1-(methylthio)-4-propyl-[1,2,4]triazolo[4,3-a]quinazolin-5-one MLS-0471508.0001 cid_16370143
Type:
Small organic molecule
Emp. Form.:
C13H14N4OS
Mol. Mass.:
274.341
SMILES:
CCCn1c2nnc(SC)n2c2ccccc2c1=O
: