Target
DNA dC->dU-editing enzyme APOBEC-3A
Ligand
BDBM80562
Substrate
Meas. Tech.
SAR analysis of small molecule inhibitors of APOBEC3A DNA Deaminase via a fluorescence-based single-stranded DNA deaminase assay - Set 2
Temperature
298.15±n/a K
IC50
28600±n/a nM
Comments
extracted
Citation
 PubChem, PC SAR analysis of small molecule inhibitors of APOBEC3A DNA Deaminase via a fluorescence-based single-stranded DNA deaminase assay - Set 2 PubChem Bioassay (2012)[AID] 
Target
Name:
DNA dC->dU-editing enzyme APOBEC-3A
Synonyms:
ABC3A_HUMAN probable DNA dC->dU-editing enzyme APOBEC-3A
Type:
Enzyme Catalytic Domain
Mol. Mass.:
23013.77
Organism:
Homo sapiens (Human)
Description:
gi_21955158
Residue:
199
  
Inhibitor
Name:
BDBM80562
Synonyms:
1-methyl-N-phenyl-3-pyridin-1-iumcarboxamide;chloride 1-methyl-N-phenylpyridin-1-ium-3-carboxamide;chloride SMR000588030 | cid_16248065
Type:
Small organic molecule
Emp. Form.:
C13H13N2O
Mol. Mass.:
213.2546
SMILES:
C[n+]1cccc(c1)C(=O)Nc1ccccc1
: