Target
Tyrosine-protein phosphatase non-receptor type 5
Ligand
BDBM88716
Substrate
Meas. Tech.
Dose response orthogonal assay of uHTS small molecule inhibitors of Striatal-Enriched Phosphatase via a colorimetric intensity assay.
IC50
72300±n/a nM
Citation
 PubChem, PC Dose response orthogonal assay of uHTS small molecule inhibitors of Striatal-Enriched Phosphatase via a colorimetric intensity assay. PubChem Bioassay (2012)[AID] 
Target
Name:
Tyrosine-protein phosphatase non-receptor type 5
Synonyms:
PTN5_HUMAN Tyrosine-protein phosphatase non-receptor type 5 | Tyrosine-protein phosphatase non-receptor type 5 isoform a
Type:
Enzyme Catalytic Domain
Mol. Mass.:
63510.68
Organism:
Homo sapiens (Human)
Description:
gi_90652859
Residue:
565
  
Inhibitor
Name:
BDBM88716
Synonyms:
2-(1,3-dioxo-2-isoindolyl)-N-[3-(1-imidazolyl)propyl]-3-phenylpropanamide 2-[1,3-bis(oxidanylidene)isoindol-2-yl]-N-(3-imidazol-1-ylpropyl)-3-phenyl-propanamide N-(3-imidazol-1-ylpropyl)-3-phenyl-2-phthalimido-propionamide cid_662579
Type:
Small organic molecule
Emp. Form.:
C23H22N4O3
Mol. Mass.:
402.4458
SMILES:
O=C(NCCCn1ccnc1)C(Cc1ccccc1)N1C(=O)c2ccccc2C1=O
: