Target
Tyrosine-protein phosphatase non-receptor type 5
Ligand
BDBM88717
Substrate
Meas. Tech.
Dose response orthogonal assay of uHTS small molecule inhibitors of Striatal-Enriched Phosphatase via a colorimetric intensity assay.
IC50
>80000±n/a nM
Citation
 PubChem, PC Dose response orthogonal assay of uHTS small molecule inhibitors of Striatal-Enriched Phosphatase via a colorimetric intensity assay. PubChem Bioassay (2012)[AID] 
Target
Name:
Tyrosine-protein phosphatase non-receptor type 5
Synonyms:
PTN5_HUMAN Tyrosine-protein phosphatase non-receptor type 5 | Tyrosine-protein phosphatase non-receptor type 5 isoform a
Type:
Enzyme Catalytic Domain
Mol. Mass.:
63510.68
Organism:
Homo sapiens (Human)
Description:
gi_90652859
Residue:
565
  
Inhibitor
Name:
BDBM88717
Synonyms:
MLS000091378 N-(3-cyanophenyl)-2-(1-methyl-3-indolyl)acetamide N-(3-cyanophenyl)-2-(1-methylindol-3-yl)ethanamide cid_3237338
Type:
Small organic molecule
Emp. Form.:
C18H15N3O
Mol. Mass.:
289.3312
SMILES:
Cn1cc(CC(=O)Nc2cccc(c2)C#N)c2ccccc12
: