Target
Tyrosine-protein phosphatase non-receptor type 5
Ligand
BDBM40987
Substrate
Meas. Tech.
Dose response orthogonal assay of uHTS small molecule inhibitors of Striatal-Enriched Phosphatase via a colorimetric intensity assay.
IC50
>80000±n/a nM
Citation
 PubChem, PC Dose response orthogonal assay of uHTS small molecule inhibitors of Striatal-Enriched Phosphatase via a colorimetric intensity assay. PubChem Bioassay (2012)[AID] 
Target
Name:
Tyrosine-protein phosphatase non-receptor type 5
Synonyms:
PTN5_HUMAN Tyrosine-protein phosphatase non-receptor type 5 | Tyrosine-protein phosphatase non-receptor type 5 isoform a
Type:
Enzyme Catalytic Domain
Mol. Mass.:
63510.68
Organism:
Homo sapiens (Human)
Description:
gi_90652859
Residue:
565
  
Inhibitor
Name:
BDBM40987
Synonyms:
MLS000109444 N-[(4Z)-4-(3H-1,3-benzoxazol-2-ylidene)-3-keto-cyclohexa-1,5-dien-1-yl]-2-(4-ethylphenoxy)acetamide N-[(4Z)-4-(3H-1,3-benzoxazol-2-ylidene)-3-oxo-1-cyclohexa-1,5-dienyl]-2-(4-ethylphenoxy)acetamide SMR000105387 | cid_5922605
Type:
Small organic molecule
Emp. Form.:
C23H20N2O4
Mol. Mass.:
388.4159
SMILES:
CCc1ccc(OCC(=O)Nc2ccc(-c3nc4ccccc4o3)c(O)c2)cc1
: