Target
Tyrosine-protein phosphatase non-receptor type 5
Ligand
BDBM82647
Substrate
Meas. Tech.
Dose response orthogonal assay of uHTS small molecule inhibitors of Striatal-Enriched Phosphatase via a colorimetric intensity assay.
IC50
>80000±n/a nM
Citation
 PubChem, PC Dose response orthogonal assay of uHTS small molecule inhibitors of Striatal-Enriched Phosphatase via a colorimetric intensity assay. PubChem Bioassay (2012)[AID] 
Target
Name:
Tyrosine-protein phosphatase non-receptor type 5
Synonyms:
PTN5_HUMAN Tyrosine-protein phosphatase non-receptor type 5 | Tyrosine-protein phosphatase non-receptor type 5 isoform a
Type:
Enzyme Catalytic Domain
Mol. Mass.:
63510.68
Organism:
Homo sapiens (Human)
Description:
gi_90652859
Residue:
565
  
Inhibitor
Name:
BDBM82647
Synonyms:
2-(1H-benzimidazol-2-ylsulfanyl)-1-(2,3-dimethylindol-1-yl)ethanone 2-(1H-benzimidazol-2-ylthio)-1-(2,3-dimethylindol-1-yl)ethanone MLS000535320 cid_704124
Type:
Small organic molecule
Emp. Form.:
C19H17N3OS
Mol. Mass.:
335.423
SMILES:
Cc1c(C)c2ccccc2n1C(=O)CSc1nc2ccccc2[nH]1
: