Target
Tyrosine-protein phosphatase non-receptor type 5
Ligand
BDBM88727
Substrate
Meas. Tech.
Dose response orthogonal assay of uHTS small molecule inhibitors of Striatal-Enriched Phosphatase via a colorimetric intensity assay.
IC50
25500±n/a nM
Citation
 PubChem, PC Dose response orthogonal assay of uHTS small molecule inhibitors of Striatal-Enriched Phosphatase via a colorimetric intensity assay. PubChem Bioassay (2012)[AID] 
Target
Name:
Tyrosine-protein phosphatase non-receptor type 5
Synonyms:
PTN5_HUMAN Tyrosine-protein phosphatase non-receptor type 5 | Tyrosine-protein phosphatase non-receptor type 5 isoform a
Type:
Enzyme Catalytic Domain
Mol. Mass.:
63510.68
Organism:
Homo sapiens (Human)
Description:
gi_90652859
Residue:
565
  
Inhibitor
Name:
BDBM88727
Synonyms:
2-thiophenecarboxylic acid [4-[(E)-[[(3-fluorophenyl)-oxomethyl]hydrazinylidene]methyl]phenyl] ester MLS000576933 [4-[(E)-[(3-fluorobenzoyl)hydrazinylidene]methyl]phenyl] thiophene-2-carboxylate cid_5332668 | thiophene-2-carboxylic acid [4-[(E)-[(3-fluorobenzoyl)hydrazono]methyl]phenyl] ester
Type:
Small organic molecule
Emp. Form.:
C19H13FN2O3S
Mol. Mass.:
368.382
SMILES:
Fc1cccc(c1)C(=O)N\N=C\c1ccc(OC(=O)c2cccs2)cc1
: