Target
Tyrosine-protein phosphatase non-receptor type 5
Ligand
BDBM88730
Substrate
Meas. Tech.
Dose response orthogonal assay of uHTS small molecule inhibitors of Striatal-Enriched Phosphatase via a colorimetric intensity assay.
IC50
>80000±n/a nM
Citation
 PubChem, PC Dose response orthogonal assay of uHTS small molecule inhibitors of Striatal-Enriched Phosphatase via a colorimetric intensity assay. PubChem Bioassay (2012)[AID] 
Target
Name:
Tyrosine-protein phosphatase non-receptor type 5
Synonyms:
PTN5_HUMAN Tyrosine-protein phosphatase non-receptor type 5 | Tyrosine-protein phosphatase non-receptor type 5 isoform a
Type:
Enzyme Catalytic Domain
Mol. Mass.:
63510.68
Organism:
Homo sapiens (Human)
Description:
gi_90652859
Residue:
565
  
Inhibitor
Name:
BDBM88730
Synonyms:
MLS000574482 N-[5-(1H-benzimidazol-2-yl)-2-chloro-phenyl]-4-ethoxy-3-nitro-benzamide SMR000195146 | cid_1338419
Type:
Small organic molecule
Emp. Form.:
C22H17ClN4O4
Mol. Mass.:
436.848
SMILES:
CCOc1ccc(cc1[N+]([O-])=O)C(=O)Nc1cc(ccc1Cl)-c1nc2ccccc2[nH]1
: