Target
Tyrosine-protein phosphatase non-receptor type 5
Ligand
BDBM81042
Substrate
Meas. Tech.
Dose response orthogonal assay of uHTS small molecule inhibitors of Striatal-Enriched Phosphatase via a colorimetric intensity assay.
IC50
42000±n/a nM
Citation
 PubChem, PC Dose response orthogonal assay of uHTS small molecule inhibitors of Striatal-Enriched Phosphatase via a colorimetric intensity assay. PubChem Bioassay (2012)[AID] 
Target
Name:
Tyrosine-protein phosphatase non-receptor type 5
Synonyms:
PTN5_HUMAN Tyrosine-protein phosphatase non-receptor type 5 | Tyrosine-protein phosphatase non-receptor type 5 isoform a
Type:
Enzyme Catalytic Domain
Mol. Mass.:
63510.68
Organism:
Homo sapiens (Human)
Description:
gi_90652859
Residue:
565
  
Inhibitor
Name:
BDBM81042
Synonyms:
(4-bromophenyl)-(4-methyl-1-piperazinyl)methanethione (4-bromophenyl)-(4-methylpiperazino)methanethione MLS000579518 cid_848272
Type:
Small organic molecule
Emp. Form.:
C12H15BrN2S
Mol. Mass.:
299.23
SMILES:
CN1CCN(CC1)C(=S)c1ccc(Br)cc1
: