Target
Tyrosine-protein phosphatase non-receptor type 5
Ligand
BDBM88733
Substrate
Meas. Tech.
Dose response orthogonal assay of uHTS small molecule inhibitors of Striatal-Enriched Phosphatase via a colorimetric intensity assay.
IC50
36900±n/a nM
Citation
 PubChem, PC Dose response orthogonal assay of uHTS small molecule inhibitors of Striatal-Enriched Phosphatase via a colorimetric intensity assay. PubChem Bioassay (2012)[AID] 
Target
Name:
Tyrosine-protein phosphatase non-receptor type 5
Synonyms:
PTN5_HUMAN Tyrosine-protein phosphatase non-receptor type 5 | Tyrosine-protein phosphatase non-receptor type 5 isoform a
Type:
Enzyme Catalytic Domain
Mol. Mass.:
63510.68
Organism:
Homo sapiens (Human)
Description:
gi_90652859
Residue:
565
  
Inhibitor
Name:
BDBM88733
Synonyms:
3-(5-chloranyl-2-methoxy-phenyl)-1-[(1-methylindol-3-yl)methyl]-1-(3-morpholin-4-ylpropyl)thiourea 3-(5-chloro-2-methoxyphenyl)-1-[(1-methyl-3-indolyl)methyl]-1-[3-(4-morpholinyl)propyl]thiourea MLS000583931 SMR000206917 | cid_12004930
Type:
Small organic molecule
Emp. Form.:
C25H31ClN4O2S
Mol. Mass.:
487.057
SMILES:
COc1ccc(Cl)cc1NC(=S)N(CCCN1CCOCC1)Cc1cn(C)c2ccccc12
: