Target
Tyrosine-protein phosphatase non-receptor type 5
Ligand
BDBM51767
Substrate
Meas. Tech.
Dose response orthogonal assay of uHTS small molecule inhibitors of Striatal-Enriched Phosphatase via a colorimetric intensity assay.
IC50
>80000±n/a nM
Citation
 PubChem, PC Dose response orthogonal assay of uHTS small molecule inhibitors of Striatal-Enriched Phosphatase via a colorimetric intensity assay. PubChem Bioassay (2012)[AID] 
Target
Name:
Tyrosine-protein phosphatase non-receptor type 5
Synonyms:
PTN5_HUMAN Tyrosine-protein phosphatase non-receptor type 5 | Tyrosine-protein phosphatase non-receptor type 5 isoform a
Type:
Enzyme Catalytic Domain
Mol. Mass.:
63510.68
Organism:
Homo sapiens (Human)
Description:
gi_90652859
Residue:
565
  
Inhibitor
Name:
BDBM51767
Synonyms:
2-[(4-methyl-2-quinolyl)thio]-N-[5-(p-tolyl)-1,2,4-thiadiazol-3-yl]acetamide N-[5-(4-methylphenyl)-1,2,4-thiadiazol-3-yl]-2-(4-methylquinolin-2-yl)sulfanyl-ethanamide N-[5-(4-methylphenyl)-1,2,4-thiadiazol-3-yl]-2-[(4-methyl-2-quinolinyl)thio]acetamide SMR000208666 | cid_4256434
Type:
Small organic molecule
Emp. Form.:
C21H18N4OS2
Mol. Mass.:
406.524
SMILES:
Cc1ccc(cc1)-c1nc(NC(=O)CSc2cc(C)c3ccccc3n2)ns1
: