Target
Tyrosine-protein phosphatase non-receptor type 5
Ligand
BDBM88738
Substrate
Meas. Tech.
Dose response orthogonal assay of uHTS small molecule inhibitors of Striatal-Enriched Phosphatase via a colorimetric intensity assay.
IC50
>80000±n/a nM
Citation
 PubChem, PC Dose response orthogonal assay of uHTS small molecule inhibitors of Striatal-Enriched Phosphatase via a colorimetric intensity assay. PubChem Bioassay (2012)[AID] 
Target
Name:
Tyrosine-protein phosphatase non-receptor type 5
Synonyms:
PTN5_HUMAN Tyrosine-protein phosphatase non-receptor type 5 | Tyrosine-protein phosphatase non-receptor type 5 isoform a
Type:
Enzyme Catalytic Domain
Mol. Mass.:
63510.68
Organism:
Homo sapiens (Human)
Description:
gi_90652859
Residue:
565
  
Inhibitor
Name:
BDBM88738
Synonyms:
3-methyl-N-(2-methyl-5-[1,3]oxazolo[4,5-b]pyridin-2-ylphenyl)butanamide 3-methyl-N-[2-methyl-5-(2-oxazolo[4,5-b]pyridinyl)phenyl]butanamide MLS000665100 cid_696894
Type:
Small organic molecule
Emp. Form.:
C18H19N3O2
Mol. Mass.:
309.3624
SMILES:
CC(C)CC(=O)Nc1cc(ccc1C)-c1nc2ncccc2o1
: