Target
Tyrosine-protein phosphatase non-receptor type 5
Ligand
BDBM88778
Substrate
Meas. Tech.
Dose response orthogonal assay of uHTS small molecule inhibitors of Striatal-Enriched Phosphatase via a colorimetric intensity assay.
IC50
>80000±n/a nM
Citation
 PubChem, PC Dose response orthogonal assay of uHTS small molecule inhibitors of Striatal-Enriched Phosphatase via a colorimetric intensity assay. PubChem Bioassay (2012)[AID] 
Target
Name:
Tyrosine-protein phosphatase non-receptor type 5
Synonyms:
PTN5_HUMAN Tyrosine-protein phosphatase non-receptor type 5 | Tyrosine-protein phosphatase non-receptor type 5 isoform a
Type:
Enzyme Catalytic Domain
Mol. Mass.:
63510.68
Organism:
Homo sapiens (Human)
Description:
gi_90652859
Residue:
565
  
Inhibitor
Name:
BDBM88778
Synonyms:
2-[2-bromanyl-4-[(Z)-[3-[2-[(4-methylphenyl)amino]-2-oxidanylidene-ethyl]-2,4-bis(oxidanylidene)-1,3-thiazolidin-5-ylidene]methyl]phenoxy]ethanoic acid 2-[2-bromo-4-[(Z)-[3-[2-(4-methylanilino)-2-oxoethyl]-2,4-dioxo-1,3-thiazolidin-5-ylidene]methyl]phenoxy]acetic acid MLS001179226 [2-bromo-4-({2,4-dioxo-3-[2-oxo-2-(4-toluidino)ethyl]-1,3-thiazolidin-5-ylidene}methyl)phenoxy]acetic acid | cid_7029231
Type:
Small organic molecule
Emp. Form.:
C21H17BrN2O6S
Mol. Mass.:
505.338
SMILES:
Cc1ccc(NC(=O)CN2C(=O)S\C(=C/c3ccc(OCC(O)=O)c(Br)c3)C2=O)cc1
: