Target
Tyrosine-protein phosphatase non-receptor type 5
Ligand
BDBM59546
Substrate
Meas. Tech.
Dose response orthogonal assay of uHTS small molecule inhibitors of Striatal-Enriched Phosphatase via a colorimetric intensity assay.
IC50
6400±n/a nM
Citation
 PubChem, PC Dose response orthogonal assay of uHTS small molecule inhibitors of Striatal-Enriched Phosphatase via a colorimetric intensity assay. PubChem Bioassay (2012)[AID] 
Target
Name:
Tyrosine-protein phosphatase non-receptor type 5
Synonyms:
PTN5_HUMAN Tyrosine-protein phosphatase non-receptor type 5 | Tyrosine-protein phosphatase non-receptor type 5 isoform a
Type:
Enzyme Catalytic Domain
Mol. Mass.:
63510.68
Organism:
Homo sapiens (Human)
Description:
gi_90652859
Residue:
565
  
Inhibitor
Name:
BDBM59546
Synonyms:
3-[7-(2-chlorobenzyl)oxy-2-keto-4,8-dimethyl-chromen-3-yl]propionic acid 3-[7-[(2-chlorophenyl)methoxy]-4,8-dimethyl-2-oxo-1-benzopyran-3-yl]propanoic acid MLS001213288 cid_1801772
Type:
Small organic molecule
Emp. Form.:
C21H19ClO5
Mol. Mass.:
386.826
SMILES:
Cc1c(OCc2ccccc2Cl)ccc2c(C)c(CCC(O)=O)c(=O)oc12
: