Target
Tyrosine-protein phosphatase non-receptor type 5
Ligand
BDBM88789
Substrate
Meas. Tech.
Dose response orthogonal assay of uHTS small molecule inhibitors of Striatal-Enriched Phosphatase via a colorimetric intensity assay.
IC50
>80000±n/a nM
Citation
 PubChem, PC Dose response orthogonal assay of uHTS small molecule inhibitors of Striatal-Enriched Phosphatase via a colorimetric intensity assay. PubChem Bioassay (2012)[AID] 
Target
Name:
Tyrosine-protein phosphatase non-receptor type 5
Synonyms:
PTN5_HUMAN Tyrosine-protein phosphatase non-receptor type 5 | Tyrosine-protein phosphatase non-receptor type 5 isoform a
Type:
Enzyme Catalytic Domain
Mol. Mass.:
63510.68
Organism:
Homo sapiens (Human)
Description:
gi_90652859
Residue:
565
  
Inhibitor
Name:
BDBM88789
Synonyms:
6-chloranyl-3-(4-methylphenyl)sulfonyl-1H-quinolin-4-one 6-chloro-3-[(4-methylphenyl)sulfonyl]quinolin-4(1H)-one MLS001199334 cid_20868646
Type:
Small organic molecule
Emp. Form.:
C16H12ClNO3S
Mol. Mass.:
333.789
SMILES:
Cc1ccc(cc1)S(=O)(=O)c1cnc2ccc(Cl)cc2c1O
: