Target
Tyrosine-protein phosphatase non-receptor type 22
Ligand
BDBM44438
Substrate
Meas. Tech.
Dose Response selectivity of inhibitors of STriatal-Enriched Phosphatase (STEP) in the Lymphoid Phosphatase (PTPN22) Inhibition Assay
IC50
13993±1150 nM
Citation
 PubChem, PC Dose Response selectivity of inhibitors of STriatal-Enriched Phosphatase (STEP) in the Lymphoid Phosphatase (PTPN22) Inhibition Assay PubChem Bioassay (2012)[AID] 
Target
Name:
Tyrosine-protein phosphatase non-receptor type 22
Synonyms:
3.1.3.48 LyP Lymphoid phosphatase (Lyp) PEST-domain phosphatase PTPN22 Tyrosine-protein phosphatase non-receptor type 22 (LYP) | tyrosine-protein phosphatase non-receptor type 22 isoform 1
Type:
Mol. Mass.:
91712.31
Organism:
Homo sapiens (Human)
Description:
Q9Y2R2
Residue:
807
  
Inhibitor
Name:
BDBM44438
Synonyms:
2-methyl-3-(4-methylphenyl)[1]benzopyrano[2,3-d]pyrimidine-4,5-dione 2-methyl-3-(p-tolyl)chromeno[2,3-d]pyrimidine-4,5-quinone SMR000047801 | cid_666560
Type:
Small organic molecule
Emp. Form.:
C19H14N2O3
Mol. Mass.:
318.3261
SMILES:
Cc1ccc(cc1)-n1c(C)nc2oc3ccccc3c(=O)c2c1=O
: