Target
Tyrosine-protein phosphatase non-receptor type 22
Ligand
BDBM81020
Substrate
Meas. Tech.
Dose Response selectivity of inhibitors of STriatal-Enriched Phosphatase (STEP) in the Lymphoid Phosphatase (PTPN22) Inhibition Assay
IC50
>100000±0 nM
Citation
 PubChem, PC Dose Response selectivity of inhibitors of STriatal-Enriched Phosphatase (STEP) in the Lymphoid Phosphatase (PTPN22) Inhibition Assay PubChem Bioassay (2012)[AID] 
Target
Name:
Tyrosine-protein phosphatase non-receptor type 22
Synonyms:
3.1.3.48 LyP Lymphoid phosphatase (Lyp) PEST-domain phosphatase PTPN22 Tyrosine-protein phosphatase non-receptor type 22 (LYP) | tyrosine-protein phosphatase non-receptor type 22 isoform 1
Type:
Mol. Mass.:
91712.31
Organism:
Homo sapiens (Human)
Description:
Q9Y2R2
Residue:
807
  
Inhibitor
Name:
BDBM81020
Synonyms:
(3,4-dichlorophenyl)-(4-ethyl-1-piperazinyl)methanethione (3,4-dichlorophenyl)-(4-ethylpiperazino)methanethione MLS000594177 cid_848275
Type:
Small organic molecule
Emp. Form.:
C13H16Cl2N2S
Mol. Mass.:
303.251
SMILES:
CCN1CCN(CC1)C(=S)c1ccc(Cl)c(Cl)c1
: