Target
Tyrosine-protein phosphatase non-receptor type 22
Ligand
BDBM80129
Substrate
Meas. Tech.
Dose Response selectivity of inhibitors of STriatal-Enriched Phosphatase (STEP) in the Lymphoid Phosphatase (PTPN22) Inhibition Assay
IC50
12775±3960 nM
Citation
 PubChem, PC Dose Response selectivity of inhibitors of STriatal-Enriched Phosphatase (STEP) in the Lymphoid Phosphatase (PTPN22) Inhibition Assay PubChem Bioassay (2012)[AID] 
Target
Name:
Tyrosine-protein phosphatase non-receptor type 22
Synonyms:
3.1.3.48 LyP Lymphoid phosphatase (Lyp) PEST-domain phosphatase PTPN22 Tyrosine-protein phosphatase non-receptor type 22 (LYP) | tyrosine-protein phosphatase non-receptor type 22 isoform 1
Type:
Mol. Mass.:
91712.31
Organism:
Homo sapiens (Human)
Description:
Q9Y2R2
Residue:
807
  
Inhibitor
Name:
BDBM80129
Synonyms:
(4-chlorophenyl)-(4-ethyl-1-piperazinyl)methanethione (4-chlorophenyl)-(4-ethylpiperazino)methanethione MLS000594090 cid_888688
Type:
Small organic molecule
Emp. Form.:
C13H17ClN2S
Mol. Mass.:
268.805
SMILES:
CCN1CCN(CC1)C(=S)c1ccc(Cl)cc1
: