Target
Tyrosine-protein phosphatase non-receptor type 22
Ligand
BDBM88739
Substrate
Meas. Tech.
Dose Response selectivity of inhibitors of STriatal-Enriched Phosphatase (STEP) in the Lymphoid Phosphatase (PTPN22) Inhibition Assay
IC50
64923±2710 nM
Citation
 PubChem, PC Dose Response selectivity of inhibitors of STriatal-Enriched Phosphatase (STEP) in the Lymphoid Phosphatase (PTPN22) Inhibition Assay PubChem Bioassay (2012)[AID] 
Target
Name:
Tyrosine-protein phosphatase non-receptor type 22
Synonyms:
3.1.3.48 LyP Lymphoid phosphatase (Lyp) PEST-domain phosphatase PTPN22 Tyrosine-protein phosphatase non-receptor type 22 (LYP) | tyrosine-protein phosphatase non-receptor type 22 isoform 1
Type:
Mol. Mass.:
91712.31
Organism:
Homo sapiens (Human)
Description:
Q9Y2R2
Residue:
807
  
Inhibitor
Name:
BDBM88739
Synonyms:
MLS000704210 N-[(E)-(5-bromanylthiophen-2-yl)methylideneamino]-3-nitro-benzamide N-[(E)-(5-bromo-2-thiophenyl)methylideneamino]-3-nitrobenzamide SMR000227120 | cid_6872971
Type:
Small organic molecule
Emp. Form.:
C12H8BrN3O3S
Mol. Mass.:
354.179
SMILES:
[O-][N+](=O)c1cccc(c1)C(=O)N\N=C\c1ccc(Br)s1
: