Target
Tyrosine-protein phosphatase non-receptor type 22
Ligand
BDBM51774
Substrate
Meas. Tech.
Dose Response selectivity of inhibitors of STriatal-Enriched Phosphatase (STEP) in the Lymphoid Phosphatase (PTPN22) Inhibition Assay
IC50
>100000±0 nM
Citation
 PubChem, PC Dose Response selectivity of inhibitors of STriatal-Enriched Phosphatase (STEP) in the Lymphoid Phosphatase (PTPN22) Inhibition Assay PubChem Bioassay (2012)[AID] 
Target
Name:
Tyrosine-protein phosphatase non-receptor type 22
Synonyms:
3.1.3.48 LyP Lymphoid phosphatase (Lyp) PEST-domain phosphatase PTPN22 Tyrosine-protein phosphatase non-receptor type 22 (LYP) | tyrosine-protein phosphatase non-receptor type 22 isoform 1
Type:
Mol. Mass.:
91712.31
Organism:
Homo sapiens (Human)
Description:
Q9Y2R2
Residue:
807
  
Inhibitor
Name:
BDBM51774
Synonyms:
1'-({[4-(aminosulfonyl)phenyl]amino}carbonothioyl)-1,4'-bipiperidine-4'-carboxamide 4-piperidin-1-yl-1-[(4-sulfamoylphenyl)carbamothioyl]piperidine-4-carboxamide MLS000621463 cid_2193503
Type:
Small organic molecule
Emp. Form.:
C18H27N5O3S2
Mol. Mass.:
425.569
SMILES:
NC(=O)C1(CCN(CC1)C(=S)Nc1ccc(cc1)S(N)(=O)=O)N1CCCCC1
: