Target
Tyrosine-protein phosphatase non-receptor type 22
Ligand
BDBM82932
Substrate
Meas. Tech.
Dose Response selectivity of inhibitors of STriatal-Enriched Phosphatase (STEP) in the Lymphoid Phosphatase (PTPN22) Inhibition Assay
IC50
50614±1160 nM
Citation
 PubChem, PC Dose Response selectivity of inhibitors of STriatal-Enriched Phosphatase (STEP) in the Lymphoid Phosphatase (PTPN22) Inhibition Assay PubChem Bioassay (2012)[AID] 
Target
Name:
Tyrosine-protein phosphatase non-receptor type 22
Synonyms:
3.1.3.48 LyP Lymphoid phosphatase (Lyp) PEST-domain phosphatase PTPN22 Tyrosine-protein phosphatase non-receptor type 22 (LYP) | tyrosine-protein phosphatase non-receptor type 22 isoform 1
Type:
Mol. Mass.:
91712.31
Organism:
Homo sapiens (Human)
Description:
Q9Y2R2
Residue:
807
  
Inhibitor
Name:
BDBM82932
Synonyms:
4-[(4-{(E)-[3-(2-ethoxy-2-oxoethyl)-2,4-dioxo-1,3-thiazolidin-5-ylidene]methyl}phenoxy)methyl]benzoic acid 4-[[4-[(E)-[3-(2-ethoxy-2-oxidanylidene-ethyl)-2,4-bis(oxidanylidene)-1,3-thiazolidin-5-ylidene]methyl]phenoxy]methyl]benzoic acid 4-[[4-[(E)-[3-(2-ethoxy-2-oxoethyl)-2,4-dioxo-5-thiazolidinylidene]methyl]phenoxy]methyl]benzoic acid SMR000558485 | cid_2286547
Type:
Small organic molecule
Emp. Form.:
C22H19NO7S
Mol. Mass.:
441.454
SMILES:
CCOC(=O)CN1C(=O)S\C(=C\c2ccc(OCc3ccc(cc3)C(O)=O)cc2)C1=O
: