Target
Tyrosine-protein phosphatase non-receptor type 22
Ligand
BDBM88805
Substrate
Meas. Tech.
Dose Response selectivity of inhibitors of STriatal-Enriched Phosphatase (STEP) in the Lymphoid Phosphatase (PTPN22) Inhibition Assay
IC50
>100000±0 nM
Citation
 PubChem, PC Dose Response selectivity of inhibitors of STriatal-Enriched Phosphatase (STEP) in the Lymphoid Phosphatase (PTPN22) Inhibition Assay PubChem Bioassay (2012)[AID] 
Target
Name:
Tyrosine-protein phosphatase non-receptor type 22
Synonyms:
3.1.3.48 LyP Lymphoid phosphatase (Lyp) PEST-domain phosphatase PTPN22 Tyrosine-protein phosphatase non-receptor type 22 (LYP) | tyrosine-protein phosphatase non-receptor type 22 isoform 1
Type:
Mol. Mass.:
91712.31
Organism:
Homo sapiens (Human)
Description:
Q9Y2R2
Residue:
807
  
Inhibitor
Name:
BDBM88805
Synonyms:
MLS002179739 N-(5-chloro-2-pyridinyl)-2-[(5,6-dimethyl-4-oxo-3H-thieno[2,3-d]pyrimidin-2-yl)methylthio]propanamide N-(5-chloropyridin-2-yl)-2-[(5,6-dimethyl-4-oxo-3H-thieno[2,3-d]pyrimidin-2-yl)methylsulfanyl]propanamide cid_25162023
Type:
Small organic molecule
Emp. Form.:
C17H17ClN4O2S2
Mol. Mass.:
408.925
SMILES:
CC(SCc1nc2sc(C)c(C)c2c(=O)[nH]1)C(=O)Nc1ccc(Cl)cn1
: