Target
Tyrosine-protein phosphatase non-receptor type 22
Ligand
BDBM88808
Substrate
Meas. Tech.
Dose Response selectivity of inhibitors of STriatal-Enriched Phosphatase (STEP) in the Lymphoid Phosphatase (PTPN22) Inhibition Assay
IC50
>100000±0 nM
Citation
 PubChem, PC Dose Response selectivity of inhibitors of STriatal-Enriched Phosphatase (STEP) in the Lymphoid Phosphatase (PTPN22) Inhibition Assay PubChem Bioassay (2012)[AID] 
Target
Name:
Tyrosine-protein phosphatase non-receptor type 22
Synonyms:
3.1.3.48 LyP Lymphoid phosphatase (Lyp) PEST-domain phosphatase PTPN22 Tyrosine-protein phosphatase non-receptor type 22 (LYP) | tyrosine-protein phosphatase non-receptor type 22 isoform 1
Type:
Mol. Mass.:
91712.31
Organism:
Homo sapiens (Human)
Description:
Q9Y2R2
Residue:
807
  
Inhibitor
Name:
BDBM88808
Synonyms:
3-nitro-N'-[(E)-(6-oxidanylidenecyclohexa-2,4-dien-1-ylidene)methyl]benzohydrazide 3-nitro-N'-[(E)-(6-oxocyclohexa-2,4-dien-1-ylidene)methyl]benzohydrazide MLS002667988 SMR001557740 | cid_5750429
Type:
Small organic molecule
Emp. Form.:
C14H11N3O4
Mol. Mass.:
285.2548
SMILES:
[O-][N+](=O)c1cccc(c1)C(=O)N\[NH+]=C\[c-]1ccccc1=O
: