Target
Botulinum neurotoxin type A
Ligand
BDBM91552
Substrate
Meas. Tech.
High-throughput multiplex microsphere dose response for inhibitors of toxin protease, specifically Botulinum neurotoxin light chain A protease, compounds from Powder Set 01
EC50
>20000±n/a nM
Citation
 PubChem, PC High-throughput multiplex microsphere dose response for inhibitors of toxin protease, specifically Botulinum neurotoxin light chain A protease, compounds from Powder Set 01 PubChem Bioassay (2012)[AID] 
Target
Name:
Botulinum neurotoxin type A
Synonyms:
BXA1_CLOBH bna | botA
Type:
PROTEIN
Mol. Mass.:
149421.96
Organism:
Clostridium botulinum (strain Hall / ATCC 3502 / NCTC 13319 / Type A)
Description:
ChEMBL_987932
Residue:
1296
  
Inhibitor
Name:
BDBM91552
Synonyms:
2-[3-(4-fluorophenyl)-5-thiophen-2-yl-3,4-dihydropyrazol-2-yl]-4-methyl-1,3-thiazole 2-[5-(4-fluorophenyl)-3-(2-thienyl)-2-pyrazolin-1-yl]-4-methyl-thiazole cid_16420926
Type:
Small organic molecule
Emp. Form.:
C17H14FN3S2
Mol. Mass.:
343.442
SMILES:
Cc1csc(n1)N1N=C(CC1c1ccc(F)cc1)c1cccs1
: