Target
Botulinum neurotoxin type A
Ligand
BDBM91553
Substrate
Meas. Tech.
High-throughput multiplex microsphere dose response for inhibitors of toxin protease, specifically Botulinum neurotoxin light chain A protease, compounds from Powder Set 01
EC50
>20000±n/a nM
Citation
 PubChem, PC High-throughput multiplex microsphere dose response for inhibitors of toxin protease, specifically Botulinum neurotoxin light chain A protease, compounds from Powder Set 01 PubChem Bioassay (2012)[AID] 
Target
Name:
Botulinum neurotoxin type A
Synonyms:
BXA1_CLOBH bna | botA
Type:
PROTEIN
Mol. Mass.:
149421.96
Organism:
Clostridium botulinum (strain Hall / ATCC 3502 / NCTC 13319 / Type A)
Description:
ChEMBL_987932
Residue:
1296
  
Inhibitor
Name:
BDBM91553
Synonyms:
2-[3-(3,4-dimethoxyphenyl)-5-phenyl-2-pyrazolin-1-yl]-4-methyl-thiazole 2-[5-(3,4-dimethoxyphenyl)-3-phenyl-3,4-dihydropyrazol-2-yl]-4-methylthiazole cid_45151253
Type:
Small organic molecule
Emp. Form.:
C21H21N3O2S
Mol. Mass.:
379.475
SMILES:
COc1ccc(cc1OC)C1=NN(C(C1)c1ccccc1)c1nc(C)cs1
: