Target
Lethal factor
Ligand
BDBM91557
Substrate
Meas. Tech.
High-throughput multiplex microsphere dose response for inhibitors of toxin protease, specifically Lethal Factor protease, compounds from Powder Set 01
EC50
>20000±n/a nM
Citation
 PubChem, PC High-throughput multiplex microsphere dose response for inhibitors of toxin protease, specifically Lethal Factor protease, compounds from Powder Set 01 PubChem Bioassay (2012)[AID] 
Target
Name:
Lethal factor
Synonyms:
Anthrax Lethal Factor (LF) Antrax lethal toxin lef | lethal factor
Type:
PROTEIN
Mol. Mass.:
93758.56
Organism:
Bacillus anthracis
Description:
ChEMBL_1460338
Residue:
809
  
Inhibitor
Name:
BDBM91557
Synonyms:
1,3,5-triphenylpyrazole cid_626614
Type:
Small organic molecule
Emp. Form.:
C21H16N2
Mol. Mass.:
296.3651
SMILES:
c1c(nn(c1-c1ccccc1)-c1ccccc1)-c1ccccc1
: