Target
Botulinum neurotoxin type F
Ligand
BDBM54599
Substrate
Meas. Tech.
High-throughput multiplex microsphere dose response for inhibitors of toxin protease, specifically Botulinum neurotoxin light chain F protease, compounds from Powder Set 01
EC50
>20000±n/a nM
Citation
 PubChem, PC High-throughput multiplex microsphere dose response for inhibitors of toxin protease, specifically Botulinum neurotoxin light chain F protease, compounds from Powder Set 01 PubChem Bioassay (2012)[AID] 
Target
Name:
Botulinum neurotoxin type F
Synonyms:
BXF_CLOBO botulinum neurotoxin type F, BoNT/F
Type:
Enzyme Catalytic Domain
Mol. Mass.:
146691.56
Organism:
Clostridium botulinum Bf
Description:
P30996
Residue:
1274
  
Inhibitor
Name:
BDBM54599
Synonyms:
1-(4-chlorophenyl)-3,5-diphenyl-2-pyrazoline UNM-0000305837 | cid_2841416
Type:
Small organic molecule
Emp. Form.:
C21H17ClN2
Mol. Mass.:
332.826
SMILES:
Clc1ccc(cc1)N1N=C(CC1c1ccccc1)c1ccccc1
: